{"text_format":"1","workbook":"xlsx","n_sheets":15,"sheets":["Vorlage","Mutschen","Alvier","Alpstein-Runde","Gonzen-Gauschla-Alvier","Falknis","Alvierkette","Grabsumrundung","Zwinglipass","Gamsberg","Pfälzerhütte-Naafkopf","Pfälzerhütte KBW 2004","Gamsalp–Langwitti–Voralp","Sagenweg Sennwald","Wassergasse-Grubenweg"],"not_rendered":{"charts":15,"images":2,"macros":0,"external_links":0,"defined_names":127,"comments":0,"pivot_tables":0},"unopened":[],"bounds":{"document_bytes":16777216,"sheet_cells":100000,"rows_first":2000,"rows_last":500,"rows_between":2000,"halvings":0,"cell_chars":16384,"cell_head_chars":4096},"cells_cut":0,"cells_raw":0,"read":"whole","date_system":"1900"}

{"sheet":"Vorlage","index":0,"n_rows":39,"n_cols":13,"rows_kept":39,"cut":false,"hidden":false,"merged":[[35,6,35,7]]}
[]
["Marschzeitberechnung",null,null,null,null,null,null,null,null,"Horizontal-Marschleistung:",5000]
[null,null,null,null,null,null,null,null,null,"Zuschlag aufwärts:",800]
[null,null,null,null,null,null,null,null,null,"Zuschlag abwärts:",1200]
[]
["TEILSTRECKE",null,null,null,null,null,"geometr. Parameter",null,null,null,"Marschzeit",null,"Bemerkungen"]
["Ort ","Anfang","Höhe","Ort ","Ende","Höhe","Distanz","kumulativ","Höhendiff.","Azimut","einzeln","kumulativ"]
[null," Koordinaten","m.ü.M.",{"$f":"IF(A9=\"\",\"\",A9)","v":"x1"}," Koordinaten",{"$f":"IF(C9=\"\",\"\",C9)","v":400},"m",0,"m","Art.Prom."]
["x1",null,400,{"$f":"IF(A10<>\"\",A10,\"\")","v":"x2"},{"$f":"IF(B10<>\"\",B10,\"\")","v":""},{"$f":"IF(C10<>\"\",C10,\"\")","v":500},100,{"$f":"IF(G9=\"\",\"\",G9)","v":100},{"$f":"IF(AND(Höhe1<>\"\",Höhe2<>\"\"),Höhe2-Höhe1,\"\")","v":100},null,{"$f":"IF(AND(G9<>\"\",I9<>\"\"),(DistHoriz/LeistungHoriz+ ABS(IF(HöhenDiff<0,HöhenDiff/ZuschlagAbw,HöhenDiff/ZuschlagAuf)))/24,\"\")","v":"00:08:42"},{"$f":"IF(K9=\"\",\"\",K9)","v":"00:08:42"}]
["x2",null,500,"x3","",600,100,{"$f":"IF(H9=\"\",\"\",H9+G10)","v":200},100,null,"00:08:42",{"$f":"IF(K10=\"\",\"\",L9+K10)","v":"00:17:24"}]
["x3",null,600,"x4","",700,100,{"$f":"IF(H10=\"\",\"\",H10+G11)","v":300},100,null,"00:08:42","00:26:06"]
["x4",null,700,"x5","",800,100,400,100,null,"00:08:42","00:34:48"]
["x5",null,800,"x6","",900,100,500,100,null,"00:08:42","00:43:30"]
["x6",null,900,"x7","",1000,100,600,100,null,"00:08:42","00:52:12"]
["x7",null,1000,"x8","",1100,100,700,100,null,"00:08:42","01:00:54"]
["x8",null,1100,"x9","",1200,100,800,100,null,"00:08:42","01:09:36"]
["x9",null,1200,"x10","",1300,100,900,100,null,"00:08:42","01:18:18"]
["x10",null,1300,"x11","",1400,100,1000,100,null,"00:08:42","01:27:00"]
["x11",null,1400,"x12","",1500,100,1100,100,null,"00:08:42","01:35:42"]
["x12",null,1500,"x13","",1600,100,1200,100,null,"00:08:42","01:44:24"]
["x13",null,1600,"x14","",1700,100,1300,100,null,"00:08:42","01:53:06"]
["x14",null,1700,"x15","",1800,100,1400,100,null,"00:08:42","02:01:48"]
["x15",null,1800,"x16","",1900,100,1500,100,null,"00:08:42","02:10:30"]
["x16",null,1900,"x17","",2000,100,1600,100,null,"00:08:42","02:19:12"]
["x17",null,2000,"x18","",2100,100,1700,100,null,"00:08:42","02:27:54"]
["x18",null,2100,"x19","",2200,100,1800,100,null,"00:08:42","02:36:36"]
["x19",null,2200,"x20","",2300,100,1900,100,null,"00:08:42","02:45:18"]
["x20",null,2300,"x21","",2400,100,2000,100,null,"00:08:42","02:54:00"]
["x21",null,2400,"x22","",2000,100,2100,-400,null,"00:21:12","03:15:12"]
["x22",null,2000,"x23","",1600,100,2200,-400,null,"00:21:12","03:36:24"]
["x23",null,1600,"x24","",1200,100,2300,-400,null,"00:21:12","03:57:36"]
["x24",null,1200,"x25","",800,100,2400,-400,null,"00:21:12","04:18:48"]
["x25",null,800,"x26","",400,100,2500,-400,null,"00:21:12","04:40:00"]
["x26",null,400,null,null,null,null,null,"",null,""]
[null,null,null,null,null,null,null,null,{"$f":"SUMIF(I9:I33,\">0\")","v":2000}]
["Total",null,null,null,null,null,{"$f":"IF(G9>0,SUM(G9:G33),\"\")","v":2500},null,null,null,{"$f":"IF(K9<>\"\",SUM(K9:K33),\"\")","v":"04:40:00"},{"$f":"IF(K36=\"\",\"\",ROUND(K36*24*4,0)/4)","v":4.75}]
[null,null,null,null,null,null,null,null,{"$f":"SUMIF(I9:I33,\"<0\")","v":-2000}]
[]
["Höhenprofil",null,null,null,null,"Leistungskilometer:",{"$f":"IF(G36=\"\",\"\",G36/1000+(I35/ZuschlagAuf+I37/-ZuschlagAbw)*(LeistungHoriz/1000))","v":23.333333333333336}]

{"sheet":"Mutschen","index":1,"n_rows":39,"n_cols":13,"rows_kept":39,"cut":false,"hidden":false,"merged":[[35,6,35,7]]}
[]
["Marschzeitberechnung",null,null,null,null,null,null,null,null,"Horizontal-Marschleistung:",5000]
[null,null,null,null,null,null,null,null,null,"Zuschlag aufwärts:",800]
[null,null,null,null,null,null,null,null,null,"Zuschlag abwärts:",1200]
[]
["TEILSTRECKE",null,null,null,null,null,"geometr. Parameter",null,null,null,"Marschzeit",null,"Bemerkungen"]
["Ort ","Anfang","Höhe","Ort ","Ende","Höhe","Distanz","kumulativ","Höhendiff.","Azimut","einzeln","kumulativ"]
[null," Koordinaten","m.ü.M.",{"$f":"IF(A9=\"\",\"\",A9)","v":"Wildhaus Parkplatz"}," Koordinaten",{"$f":"IF(C9=\"\",\"\",C9)","v":1098},"m",0,"m","Art.Prom.",null,null,"Aug. 1999 ?"]
["Wildhaus Parkplatz","74500/229960",1098,{"$f":"IF(A10<>\"\",A10,\"\")","v":"Fros Pt. 1389"},{"$f":"IF(B10<>\"\",B10,\"\")","v":""},{"$f":"IF(C10<>\"\",C10,\"\")","v":1389},1700,{"$f":"IF(G9=\"\",\"\",G9)","v":1700},{"$f":"IF(AND(Höhe1<>\"\",Höhe2<>\"\"),Höhe2-Höhe1,\"\")","v":291},null,{"$f":"IF(AND(G9<>\"\",I9<>\"\"),(DistHoriz/LeistungHoriz+ ABS(IF(HöhenDiff<0,HöhenDiff/ZuschlagAbw,HöhenDiff/ZuschlagAuf)))/24,\"\")","v":"00:42:13.500"},{"$f":"IF(K9=\"\",\"\",K9)","v":"00:42:13.500"}]
["Fros Pt. 1389",null,1389,"Alp Tesel","",1433,1000,{"$f":"IF(H9=\"\",\"\",H9+G10)","v":2700},44,null,"00:15:18",{"$f":"IF(K10=\"\",\"\",L9+K10)","v":"00:57:31.500"}]
["Alp Tesel",null,1433,"Chreialp","",1817,1700,4400,384,null,"00:49:12","01:46:43.500"]
["Chreialp",null,1817,"Zwinglipass","",2011,1000,5400,194,null,"00:26:33","02:13:16.500"]
["Zwinglipass",null,2011,"Chreialpfirst","",2126,1500,6900,115,null,"00:26:37.500","02:39:54"]
["Chreialpfirst",null,2126,"Mutschensattel","",2069,600,7500,-57,null,"00:10:03","02:49:57"]
["Mutschensattel",null,2069,"Mutschen","",2122,100,7600,53,null,"00:05:10.500","02:55:07.500"]
["Mutschen",null,2122,"Alp Grueb","",1752,1600,9200,-370,null,"00:37:42","03:32:49.500"]
["Alp Grueb",null,1752,"Fros Pt. 1389","",1389,2800,12000,-363,null,"00:51:45","04:24:34.500"]
["Fros Pt. 1389",null,1389,"Wildhaus Parkplatz","",1098,1700,13700,-291,null,"00:34:57","04:59:31.500"]
["Wildhaus Parkplatz",null,1098,"","","",null,13700,"",null,"",""]
[null,null,null,"","","",null,13700,"",null,"",""]
[null,null,null,"","","",null,13700,"",null,"",""]
[null,null,null,"","","",null,13700,"",null,"",""]
[null,null,null,"","","",null,13700,"",null,"",""]
[null,null,null,"","","",null,13700,"",null,"",""]
[null,null,null,"","","",null,13700,"",null,"",""]
[null,null,null,"","","",null,13700,"",null,"",""]
[null,null,null,"","","",null,13700,"",null,"",""]
[null,null,null,"","","",null,13700,"",null,"",""]
[null,null,null,"","","",null,13700,"",null,"",""]
[null,null,null,"","","",null,13700,"",null,"",""]
[null,null,null,"","","",null,13700,"",null,"",""]
[null,null,null,"","","",null,13700,"",null,"",""]
[null,null,null,"","","",null,13700,"",null,"",""]
[null,null,null,null,null,null,null,null,"",null,""]
[null,null,null,null,null,null,null,null,{"$f":"SUMIF(I9:I33,\">0\")","v":1081}]
["Total",null,null,null,null,null,{"$f":"IF(G9>0,SUM(G9:G33),\"\")","v":13700},null,null,null,{"$f":"IF(K9<>\"\",SUM(K9:K33),\"\")","v":"04:59:31.500"},{"$f":"IF(K36=\"\",\"\",ROUND(K36*24*4,0)/4)","v":5}]
[null,null,null,null,null,null,null,null,{"$f":"SUMIF(I9:I33,\"<0\")","v":-1081}]
[]
["Höhenprofil",null,null,null,null,"Leistungskilometer:",{"$f":"IF(G36=\"\",\"\",G36/1000+(I35/100))","v":24.509999999999998}]

{"sheet":"Alvier","index":2,"n_rows":39,"n_cols":13,"rows_kept":39,"cut":false,"hidden":false,"merged":[[35,6,35,7]]}
[]
["Marschzeitberechnung",null,null,null,null,null,null,null,null,"Horizontal-Marschleistung:",5000]
[null,null,null,null,null,null,null,null,null,"Zuschlag aufwärts:",800]
[null,null,null,null,null,null,null,null,null,"Zuschlag abwärts:",1200]
[]
["TEILSTRECKE",null,null,null,null,null,"geometr. Parameter",null,null,null,"Marschzeit",null,"Bemerkungen"]
["Ort ","Anfang","Höhe","Ort ","Ende","Höhe","Distanz","kumulativ","Höhendiff.","Azimut","einzeln","kumulativ"]
[null," Koordinaten","m.ü.M.",{"$f":"IF(A9=\"\",\"\",A9)","v":"Oberschan Pt 1497"}," Koordinaten",{"$f":"IF(C9=\"\",\"\",C9)","v":1497},"m",0,"m","Art.Prom.",null,null,"Sep 1999 ?"]
["Oberschan Pt 1497","751500/217300",1497,{"$f":"IF(A10<>\"\",A10,\"\")","v":"Pt. 1410"},{"$f":"IF(B10<>\"\",B10,\"\")","v":""},{"$f":"IF(C10<>\"\",C10,\"\")","v":1410},700,{"$f":"IF(G9=\"\",\"\",G9)","v":700},{"$f":"IF(AND(Höhe1<>\"\",Höhe2<>\"\"),Höhe2-Höhe1,\"\")","v":-87},null,{"$f":"IF(AND(G9<>\"\",I9<>\"\"),(DistHoriz/LeistungHoriz+ ABS(IF(HöhenDiff<0,HöhenDiff/ZuschlagAbw,HöhenDiff/ZuschlagAuf)))/24,\"\")","v":"00:12:45"},{"$f":"IF(K9=\"\",\"\",K9)","v":"00:12:45"}]
["Pt. 1410",null,1410,"Flidachöpf","",1540,1250,{"$f":"IF(H9=\"\",\"\",H9+G10)","v":1950},130,null,"00:24:45",{"$f":"IF(K10=\"\",\"\",L9+K10)","v":"00:37:30"}]
["Flidachöpf",null,1540,"Pt. 1693","",1693,900,2850,153,null,"00:22:16.500","00:59:46.500"]
["Pt. 1693",null,1693,"Pt. 1803","",1803,800,3650,110,null,"00:17:51","01:17:37.500"]
["Pt. 1803",null,1803,"Sattel","",2070,950,4600,267,null,"00:31:25.500","01:49:03"]
["Sattel",null,2070,"Alvier","",2343,850,5450,273,null,"00:30:40.500","02:19:43.500"]
["Alvier",null,2343,"Chemmi","",2185,400,5850,-158,null,"00:12:42","02:32:25.500"]
["Chemmi",null,2185,"Pt 1880","",1880,400,6250,-305,null,"00:20:03","02:52:28.500"]
["Pt 1880",null,1880,"Palfries (Waldguet)","",1700,1200,7450,-180,null,"00:23:24","03:15:52.500"]
["Palfries (Waldguet)",null,1700,"Hinterlabria (Übergang)","",1780,500,7950,80,null,"00:12:00","03:27:52.500"]
["Hinterlabria (Übergang)",null,1780,"Oberschan Pt 1497","751500/217300",1497,1600,9550,-283,null,"00:33:21","04:01:13.500"]
["Oberschan Pt 1497","751500/217300",1497,"","","",null,9550,"",null,"",""]
[null,null,null,"","","",null,9550,"",null,"",""]
[null,null,null,"","","",null,9550,"",null,"",""]
[null,null,null,"","","",null,9550,"",null,"",""]
[null,null,null,"","","",null,9550,"",null,"",""]
[null,null,null,"","","",null,9550,"",null,"",""]
[null,null,null,"","","",null,9550,"",null,"",""]
[null,null,null,"","","",null,9550,"",null,"",""]
[null,null,null,"","","",null,9550,"",null,"",""]
[null,null,null,"","","",null,9550,"",null,"",""]
[null,null,null,"","","",null,9550,"",null,"",""]
[null,null,null,"","","",null,9550,"",null,"",""]
[null,null,null,"","","",null,9550,"",null,"",""]
[null,null,null,"","","",null,9550,"",null,"",""]
[null,null,null,null,null,null,null,null,"",null,""]
[null,null,null,null,null,null,null,null,{"$f":"SUMIF(I9:I33,\">0\")","v":1013}]
["Total",null,null,null,null,null,{"$f":"IF(G9>0,SUM(G9:G33),\"\")","v":9550},null,null,null,{"$f":"IF(K9<>\"\",SUM(K9:K33),\"\")","v":"04:01:13.500"},{"$f":"IF(K36=\"\",\"\",ROUND(K36*24*4,0)/4)","v":4}]
[null,null,null,null,null,null,null,null,{"$f":"SUMIF(I9:I33,\"<0\")","v":-1013}]
[]
["Höhenprofil",null,null,null,null,"Leistungskilometer:",{"$f":"IF(G36=\"\",\"\",G36/1000+(I35/100))","v":19.68}]

{"sheet":"Alpstein-Runde","index":3,"n_rows":39,"n_cols":13,"rows_kept":39,"cut":false,"hidden":false,"merged":[[35,6,35,7]]}
[]
["Marschzeitberechnung",null,null,null,null,null,null,null,null,"Horizontal-Marschleistung:",5000,null,5000]
[null,null,null,null,null,null,null,null,null,"Zuschlag aufwärts:",800,"mein Tempo",1600]
[null,null,null,null,null,null,null,null,null,"Zuschlag abwärts:",1200,null,1800]
[]
["TEILSTRECKE",null,null,null,null,null,"geometr. Parameter",null,null,null,"Marschzeit",null,"Bemerkungen"]
["Ort ","Anfang","Höhe","Ort ","Ende","Höhe","Distanz","kumulativ","Höhendiff.","Azimut","einzeln","kumulativ"]
[null," Koordinaten","m.ü.M.",{"$f":"IF(A9=\"\",\"\",A9)","v":"Plona"}," Koordinaten",{"$f":"IF(C9=\"\",\"\",C9)","v":700},"m",0,"m","Art.Prom.",null,null,"11.9.1999 ?"]
["Plona","756240/239210",700,{"$f":"IF(A10<>\"\",A10,\"\")","v":"Unterkamor"},{"$f":"IF(B10<>\"\",B10,\"\")","v":""},{"$f":"IF(C10<>\"\",C10,\"\")","v":1588},4000,{"$f":"IF(G9=\"\",\"\",G9)","v":4000},{"$f":"IF(AND(Höhe1<>\"\",Höhe2<>\"\"),Höhe2-Höhe1,\"\")","v":888},null,{"$f":"IF(AND(G9<>\"\",I9<>\"\"),(DistHoriz/LeistungHoriz+ ABS(IF(HöhenDiff<0,HöhenDiff/ZuschlagAbw,HöhenDiff/ZuschlagAuf)))/24,\"\")","v":"01:54:36"},{"$f":"IF(K9=\"\",\"\",K9)","v":"01:54:36"},"1 Std. Anfahrt mit Velo"]
["Unterkamor",null,1588,"Hoher Kasten","",1795,1750,{"$f":"IF(H9=\"\",\"\",H9+G10)","v":5750},207,null,"00:36:31.500",{"$f":"IF(K10=\"\",\"\",L9+K10)","v":"02:31:07.500"},"1 Std. 40' eff."]
["Hoher Kasten",null,1795,"Baritsch","",1591,800,6550,-204,null,"00:19:48","02:50:55.500"]
["Baritsch",null,1591,"Stauberenfirst","",1693,2600,9150,102,null,"00:38:51","03:29:46.500"]
["Stauberenfirst",null,1693,"Bollenweeser Schafberg","",1791,2800,11950,98,null,"00:40:57","04:10:43.500"]
["Bollenweeser Schafberg",null,1791,"Saxer Lücke","",1649,700,12650,-142,null,"00:15:30","04:26:13.500"]
["Saxer Lücke",null,1649,"Roslenalp","",1767,700,13350,118,null,"00:17:15","04:43:28.500"]
["Roslenalp",null,1767,"Wetterloch","",2030,900,14250,263,null,"00:30:31.500","05:14:00"]
["Wetterloch",null,2030,"Mutschen","",2122,900,15150,92,null,"00:17:42","05:31:42"]
["Mutschen",null,2122,"Alp Grueb","",1752,1600,16750,-370,null,"00:37:42","06:09:24"]
["Alp Grueb",null,1752,"Fros Pt. 1389","",1389,2800,19550,-363,null,"00:51:45","07:01:09"]
["Fros Pt. 1389",null,1389,"Wildhaus Zentrum","",1090,1800,21350,-299,null,"00:36:33","07:37:42","1 1/4 Std. eff."]
["Wildhaus Zentrum",null,1090,"Kollersweid-Munzenried","",1027,900,22250,-63,null,"00:13:57","07:51:39"]
["Kollersweid-Munzenried",null,1027,"Kollersweidlift top","",1243,1100,23350,216,null,"00:29:24","08:21:03"]
["Kollersweidlift top",null,1243,"Pt. 1310","",1310,200,23550,67,null,"00:07:25.500","08:28:28.500"]
["Pt. 1310",null,1310,"Ölberg","",1431,1800,25350,121,null,"00:30:40.500","08:59:09"]
["Ölberg",null,1431,"Herti","",1399,1000,26350,-32,null,"00:13:36","09:12:45","2 1/2 Std. eff."]
["Herti",null,1399,"Rohregg","",1096,1750,28100,-303,null,"00:36:09","09:48:54"]
["Rohregg",null,1096,"Eggenberg","",960,1100,29200,-136,null,"00:20:00","10:08:54"]
["Eggenberg",null,960,"Kohlplatz","",497,2100,31300,-463,null,"00:48:21","10:57:15"]
["Kohlplatz",null,497,"","","",null,31300,"",null,"",""]
[null,null,null,"","","",null,31300,"",null,"",""]
[null,null,null,"","","",null,31300,"",null,"",""]
[null,null,null,"","","",null,31300,"",null,"",""]
[null,null,null,"","","",null,31300,"",null,"",""]
[null,null,null,null,null,null,null,null,"",null,""]
[null,null,null,null,null,null,null,null,{"$f":"SUMIF(I9:I33,\">0\")","v":2172}]
["Total",null,null,null,null,null,{"$f":"IF(G9>0,SUM(G9:G33),\"\")","v":31300},null,null,null,{"$f":"IF(K9<>\"\",SUM(K9:K33),\"\")","v":"10:57:15"},{"$f":"IF(K36=\"\",\"\",ROUND(K36*24*4,0)/4)","v":11},"9 Std. eff."]
[null,null,null,null,null,null,null,null,{"$f":"SUMIF(I9:I33,\"<0\")","v":-2375}]
[]
["Höhenprofil",null,null,null,null,"Leistungskilometer:",{"$f":"IF(G36=\"\",\"\",G36/1000+(I35/100))","v":53.019999999999996}]

{"sheet":"Gonzen-Gauschla-Alvier","index":4,"n_rows":39,"n_cols":13,"rows_kept":39,"cut":false,"hidden":false,"merged":[[35,6,35,7]]}
[]
["Marschzeitberechnung",null,null,null,null,null,null,null,null,"Horizontal-Marschleistung:",5000,null,5000]
[null,null,null,null,null,null,null,null,null,"Zuschlag aufwärts:",800,"mein Tempo",1600]
[null,null,null,null,null,null,null,null,null,"Zuschlag abwärts:",1200,null,1800]
[]
["TEILSTRECKE",null,null,null,null,null,"geometr. Parameter",null,null,null,"Marschzeit",null,"Bemerkungen"]
["Ort ","Anfang","Höhe","Ort ","Ende","Höhe","Distanz","kumulativ","Höhendiff.","Azimut","einzeln","kumulativ","1999-10-27"]
[null," Koordinaten","m.ü.M.",{"$f":"IF(A9=\"\",\"\",A9)","v":"Sargans Zentrum"}," Koordinaten",{"$f":"IF(C9=\"\",\"\",C9)","v":483},"m",0,"m","Art.Prom.",null,null,"eff. Zeit"]
["Sargans Zentrum",null,483,{"$f":"IF(A10<>\"\",A10,\"\")","v":"Pt 731"},{"$f":"IF(B10<>\"\",B10,\"\")","v":""},{"$f":"IF(C10<>\"\",C10,\"\")","v":731},1750,{"$f":"IF(G9=\"\",\"\",G9)","v":1750},{"$f":"IF(AND(Höhe1<>\"\",Höhe2<>\"\"),Höhe2-Höhe1,\"\")","v":248},null,{"$f":"IF(AND(G9<>\"\",I9<>\"\"),(DistHoriz/LeistungHoriz+ ABS(IF(HöhenDiff<0,HöhenDiff/ZuschlagAbw,HöhenDiff/ZuschlagAuf)))/24,\"\")","v":"00:39:36"},{"$f":"IF(K9=\"\",\"\",K9)","v":"00:39:36"},"23'"]
["Pt 731",null,731,"Leiter Fuss","",1220,2750,{"$f":"IF(H9=\"\",\"\",H9+G10)","v":4500},489,null,"01:09:40.500",{"$f":"IF(K10=\"\",\"\",L9+K10)","v":"01:49:16.500"},"47'"]
["Leiter Fuss",null,1220,"Älpli","",1337,300,{"$f":"IF(H10=\"\",\"\",H10+G11)","v":4800},117,null,"00:12:22.500","02:01:39","8'"]
["Älpli",null,1337,"Gonzen","",1829,1600,6400,492,null,"00:56:06","02:57:45","38' (exkl. 8' Pause)"]
["Gonzen",null,1829,"Waldguet Verzw.","",1690,3250,9650,-139,null,"00:45:57","03:43:42","36'"]
["Waldguet Verzw.",null,1690,"Verzw. Pt. 1789","",1789,800,10450,99,null,"00:17:01.500","04:00:43.500","15'"]
["Verzw. Pt. 1789",null,1789,"Chemmi","",2185,1075,11525,396,null,"00:42:36","04:43:19.500","31'"]
["Chemmi",null,2185,"Forggla","",2070,350,11875,-115,null,"00:09:57","04:53:16.500"]
["Forggla",null,2070,"Gauschla","",2310,1250,13125,240,null,"00:33:00","05:26:16.500","35' (exkl. 13' Pause)"]
["Gauschla",null,2310,"Forggla","",2070,1250,14375,-240,null,"00:27:00","05:53:16.500"]
["Forggla",null,2070,"Chemmi","",2185,350,14725,115,null,"00:12:49.500","06:06:06"]
["Chemmi",null,2185,"Alvier","",2343,400,15125,158,null,"00:16:39","06:22:45","38' (exkl. 7' Pause)"]
["Alvier",null,2343,"Malschüel Obersäss","",1777,1975,17100,-566,null,"00:52:00","07:14:45"]
["Malschüel Obersäss",null,1777,"Malschüel Untersäss","",1487,1250,18350,-290,null,"00:29:30","07:44:15"]
["Malschüel Untersäss",null,1487,"Gamshalden","",1506,500,18850,19,null,"00:07:25.500","07:51:40.500"]
["Gamshalden",null,1506,"Buchser Malbun","",1369,2600,21450,-137,null,"00:38:03","08:29:43.500","1h 43' (exkl. 6' Pause)"]
["Buchser Malbun",null,1369,"Kurhaus","",1111,1275,22725,-258,null,"00:28:12","08:57:55.500"]
["Kurhaus",null,1111,"Buchs Zentrum Pt. 451","",451,3575,26300,-660,null,"01:15:54","10:13:49.500","1h 41'"]
["Buchs Zentrum Pt. 451",null,451,"Grabs Chilbibrugg","",476,2950,29250,25,null,"00:37:16.500","10:51:06","36'"]
["Grabs Chilbibrugg",null,476,"","","",null,29250,"",null,"","","Malbun-Buchs"]
[null,null,null,"","","",null,29250,"",null,"","","längerer Weg:"]
[null,null,null,"","","",null,29250,"",null,"","","Strasse entlang (dunkel)"]
[null,null,null,"","","",null,29250,"",null,"","","zurück und Umweg"]
[null,null,null,"","","",null,29250,"",null,"","","wegen"]
[null,null,null,"","","",null,29250,"",null,"","","streunenden Hunden"]
[null,null,null,null,null,null,null,null,"",null,""]
[null,null,null,null,null,null,null,null,{"$f":"SUMIF(I9:I33,\">0\")","v":2398}]
["Total",null,null,null,null,null,{"$f":"IF(G9>0,SUM(G9:G33),\"\")","v":29250},null,null,null,{"$f":"IF(K9<>\"\",SUM(K9:K33),\"\")","v":"10:51:06"},{"$f":"IF(K36=\"\",\"\",ROUND(K36*24*4,0)/4)","v":10.75},"8h 39' (exkl. 27' Pause)"]
[null,null,null,null,null,null,null,null,{"$f":"SUMIF(I9:I33,\"<0\")","v":-2405}]
[]
["Höhenprofil",null,null,null,null,"Leistungskilometer:",{"$f":"IF(G36=\"\",\"\",G36/1000+(I35/100))","v":53.230000000000004}]

{"sheet":"Falknis","index":5,"n_rows":39,"n_cols":13,"rows_kept":39,"cut":false,"hidden":false,"merged":[[35,6,35,7]]}
[]
["Marschzeitberechnung",null,null,null,null,null,null,null,null,"Horizontal-Marschleistung:",5000,null,5000]
[null,null,null,null,null,null,null,null,null,"Zuschlag aufwärts:",800,"mein Tempo",1450]
[null,null,null,null,null,null,null,null,null,"Zuschlag abwärts:",1200,null,2700]
[]
["TEILSTRECKE",null,null,null,null,null,"geometr. Parameter",null,null,null,"Marschzeit",null,"Bemerkungen"]
["Ort ","Anfang","Höhe","Ort ","Ende","Höhe","Distanz","kumulativ","Höhendiff.","Azimut","einzeln","kumulativ","1999-11-02"]
[null," Koordinaten","m.ü.M.",{"$f":"IF(A9=\"\",\"\",A9)","v":"St. Luzisteig"}," Koordinaten",{"$f":"IF(C9=\"\",\"\",C9)","v":691},"m",0,"m","Art.Prom.",null,null,"eff. Zeit (ohne Pausen)"]
["St. Luzisteig","758750/211750",691,{"$f":"IF(A10<>\"\",A10,\"\")","v":"Fläscher Tannwald"},{"$f":"IF(B10<>\"\",B10,\"\")","v":""},{"$f":"IF(C10<>\"\",C10,\"\")","v":837},1275,{"$f":"IF(G9=\"\",\"\",G9)","v":1275},{"$f":"IF(AND(Höhe1<>\"\",Höhe2<>\"\"),Höhe2-Höhe1,\"\")","v":146},null,{"$f":"IF(AND(G9<>\"\",I9<>\"\"),(DistHoriz/LeistungHoriz+ ABS(IF(HöhenDiff<0,HöhenDiff/ZuschlagAbw,HöhenDiff/ZuschlagAuf)))/24,\"\")","v":"00:26:15"},{"$f":"IF(K9=\"\",\"\",K9)","v":"00:26:15"},17]
["Fläscher Tannwald",null,837,"Loch-Gleggtobel (Brücke)","",990,975,{"$f":"IF(H9=\"\",\"\",H9+G10)","v":2250},153,null,"00:23:10.500",{"$f":"IF(K10=\"\",\"\",L9+K10)","v":"00:49:25.500"},14]
["Loch-Gleggtobel (Brücke)",null,990,"Enderlinhütte SAC","",1501,1150,3400,511,null,"00:52:07.500","01:41:33",35]
["Enderlinhütte SAC",null,1501,"Unter den Türm (Kehrpt.)","760690/212260",1800,550,3950,299,null,"00:29:01.500","02:10:34.500",20]
["Unter den Türm (Kehrpt.)","760690/212260",1800,"Fläscher Fürggli","",2247,1375,5325,447,null,"00:50:01.500","03:00:36",40]
["Fläscher Fürggli",null,2247,"Falknis","",2562,950,6275,315,null,"00:35:01.500","03:35:37.500",25]
["Falknis",null,2562,"Ob den Türm (ab-auf-Wechsel)","",2380,450,6725,-182,null,"00:14:30","03:50:07.500",15]
["Ob den Türm (ab-auf-Wechsel)",null,2380,"Falknishorn (Mazorakopf)","",2452,375,7100,72,null,"00:09:54","04:00:01.500",9]
["Falknishorn (Mazorakopf)",null,2452,"Mazorahöhi","",2045,1275,8375,-407,null,"00:35:39","04:35:40.500",32]
["Mazorahöhi",null,2045,"Rotspitz","",{"$f":"IF(C19<>\"\",C19,\"\")","v":2127},325,8700,82,null,"00:10:03","04:45:43.500",7]
["Rotspitz",null,2127,"Mittlerspitz","",1897,1275,9975,-230,null,"00:26:48","05:12:31.500",23]
["Mittlerspitz",null,1897,"Würznerhorn (Guschner Gir)","",1713,750,10725,-184,null,"00:18:12","05:30:43.500",13]
["Würznerhorn (Guschner Gir)",null,1713,"Birch","759010/213975",1370,1300,12025,-343,null,"00:32:45","06:03:28.500",20]
["Birch","759010/213975",1370,"Guscha","",1115,1050,13075,-255,null,"00:25:21","06:28:49.500",14]
["Guscha",null,1115,"Rappentobel (Pt. 834)","",834,1300,14375,-281,null,"00:29:39","06:58:28.500",15]
["Rappentobel (Pt. 834)",null,834,"St. Luzisteig","758750/211750",691,725,15100,-143,null,"00:15:51","07:14:19.500",10]
["St. Luzisteig","758750/211750",691,"","","",null,15100,"",null,"",""]
[null,null,null,"","","",null,15100,"",null,"","","Pausen (tot. 49')"]
[null,null,null,"","","",null,15100,"",null,"","","10' Enderlinhütte"]
[null,null,null,"","","",null,15100,"",null,"","","15' Falknis"]
[null,null,null,"","","",null,15100,"",null,"","","4' Mazorakopf"]
[null,null,null,"","","",null,15100,"",null,"","","2' Rotspitz"]
[null,null,null,"","","",null,15100,"",null,"","","8' Mittlerspitz"]
[null,null,null,"","","",null,15100,"",null,"","","10' Birch (Gespräch)"]
[null,null,null,"","","",null,15100,"",null,"",""]
[null,null,null,null,null,null,null,null,"",null,""]
[null,null,null,null,null,null,null,null,{"$f":"SUMIF(I9:I33,\">0\")","v":2025}]
["Total",null,null,null,null,null,{"$f":"IF(G9>0,SUM(G9:G33),\"\")","v":15100},null,null,null,{"$f":"IF(K9<>\"\",SUM(K9:K33),\"\")","v":"07:14:19.500"},{"$f":"IF(K36=\"\",\"\",ROUND(K36*24*4,0)/4)","v":7.25},{"$f":"ROUND(SUM(M9:M24)/60*4,0)/4","v":5.25}]
[null,null,null,null,null,null,null,null,{"$f":"SUMIF(I9:I33,\"<0\")","v":-2025}]
[]
["Höhenprofil",null,null,null,null,"Leistungskilometer:",{"$f":"IF(G36=\"\",\"\",G36/1000+(I35/100))","v":35.35}]

{"sheet":"Alvierkette","index":6,"n_rows":56,"n_cols":13,"rows_kept":56,"cut":false,"hidden":false,"merged":[[52,6,52,7]]}
[]
["Marschzeitberechnung",null,null,null,null,null,null,null,null,"Horizontal-Marschleistung:",5000]
[null,null,null,null,null,null,null,null,null,"Zuschlag aufwärts:",800]
[null,null,null,null,null,null,null,null,null,"Zuschlag abwärts:",1200]
[]
["TEILSTRECKE",null,null,null,null,null,"geometr. Parameter",null,null,null,"Marschzeit",null,"Bemerkungen"]
["Ort ","Anfang","Höhe","Ort ","Ende","Höhe","Distanz","kumulativ","Höhendiff.","Azimut","einzeln","kumulativ"]
[null," Koordinaten","m.ü.M.",{"$f":"IF(A9=\"\",\"\",A9)","v":"Grabs (Simmibödeli)"}," Koordinaten",{"$f":"IF(C9=\"\",\"\",C9)","v":547},"m",0,"m","Art.Prom."]
["Grabs (Simmibödeli)","750'850/228'900",547,{"$f":"IF(A10<>\"\",A10,\"\")","v":"Loch"},"",749,1250,{"$f":"IF(G9=\"\",\"\",G9)","v":1250},{"$f":"IF(AND(Höhe1<>\"\",Höhe2<>\"\"),Höhe2-Höhe1,\"\")","v":202},null,{"$f":"IF(AND(G9<>\"\",I9<>\"\"),(DistHoriz/LeistungHoriz+ ABS(IF(HöhenDiff<0,HöhenDiff/ZuschlagAbw,HöhenDiff/ZuschlagAuf)))/24,\"\")","v":"00:30:09"},{"$f":"IF(K9=\"\",\"\",K9)","v":"00:30:09"}]
["Loch",null,749,"Bädli (Abzweigung)","",890,900,{"$f":"IF(H9=\"\",\"\",H9+G10)","v":2150},141,null,{"$f":"IF(AND(G10<>\"\",I10<>\"\"),(DistHoriz/LeistungHoriz+ ABS(IF(HöhenDiff<0,HöhenDiff/ZuschlagAbw,HöhenDiff/ZuschlagAuf)))/24,\"\")","v":"00:21:22.500"},{"$f":"IF(K10=\"\",\"\",L9+K10)","v":"00:51:31.500"}]
["Bädli (Abzweigung)",null,890,"Hiltisbrunnen","",1208,2750,{"$f":"IF(H10=\"\",\"\",H10+G11)","v":4900},318,null,{"$f":"IF(AND(G11<>\"\",I11<>\"\"),(DistHoriz/LeistungHoriz+ ABS(IF(HöhenDiff<0,HöhenDiff/ZuschlagAbw,HöhenDiff/ZuschlagAuf)))/24,\"\")","v":"00:56:51"},{"$f":"IF(K11=\"\",\"\",L10+K11)","v":"01:48:22.500"}]
["Hiltisbrunnen",null,1208,{"$f":"IF(A13<>\"\",A13,\"\")","v":"Schöntobel"},{"$f":"IF(B13<>\"\",B13,\"\")","v":""},{"$f":"IF(C13<>\"\",C13,\"\")","v":1391},2650,7550,183,null,{"$f":"IF(AND(G12<>\"\",I12<>\"\"),(DistHoriz/LeistungHoriz+ ABS(IF(HöhenDiff<0,HöhenDiff/ZuschlagAbw,HöhenDiff/ZuschlagAuf)))/24,\"\")","v":"00:45:31.500"},{"$f":"IF(K12=\"\",\"\",L11+K12)","v":"02:33:54"}]
["Schöntobel",null,1391,"Gamsalp","",1767,2950,10500,376,null,"01:03:36","03:37:30"]
["Gamsalp",null,1767,"Gamserrugg","",2070,1450,11950,303,null,"00:40:07.500","04:17:37.500"]
["Gamserrugg",null,2070,"Sattel","",1944,925,12875,-126,null,"00:17:24","04:35:01.500"]
["Sattel",null,1944,"Chäserrugg","",2262,1850,14725,318,null,"00:46:03","05:21:04.500"]
["Chäserrugg",null,2262,"Tistencholben","",2160,1650,16375,-102,null,"00:24:54","05:45:58.500"]
["Tistencholben",null,2160,"Sattel","",1944,2350,18725,-216,null,"00:39:00","06:24:58.500"]
["Sattel",null,1944,"Schlawitz (Verwz. Pizol)","",1710,1150,19875,-234,null,"00:25:30","06:50:28.500"]
["Schlawitz (Verwz. Pizol)",null,1710,"Nideri","",1833,500,20375,123,null,"00:15:13.500","07:05:42"]
["Nideri",null,1833,"Höchst","",2025,1000,21375,192,null,"00:26:24","07:32:06"]
["Höchst",null,2025,"Sichelchamm","",2269,1650,23025,244,null,"00:38:06","08:10:12"]
["Sichelchamm",null,2269,"Schiffloch","",2000,375,23400,-269,null,"00:17:57","08:28:09"]
["Schiffloch",null,2000,"Schiffberg","",2195,450,23850,195,null,"00:20:01.500","08:48:10.500"]
["Schiffberg",null,2195,"Gamsberg","",2385,1050,24900,190,null,"00:26:51","09:15:01.500"]
["Gamsberg",null,2385,"Chemmi (Gamsberg)","",2170,425,25325,-215,null,"00:15:51","09:30:52.500"]
["Chemmi (Gamsberg)",null,2170,"Loch (Büelen-Nideri)","",1860,1100,26425,-310,null,"00:28:42","09:59:34.500"]
["Loch (Büelen-Nideri)",null,1860,"Rotstein","",2225,1400,27825,365,null,"00:44:10.500","10:43:45"]
["Rotstein",null,2225,"Sichli","",2320,450,28275,95,null,"00:12:31.500","10:56:16.500"]
["Sichli",null,2320,"Rosswis","",2334,300,28575,14,null,"00:04:39","11:00:55.500"]
["Rosswis",null,2334,"Sisitzgrat","",2016,1650,30225,-318,null,"00:35:42","11:36:37.500"]
["Sisitzgrat",null,2016,"Margelchopf","",2163,500,30725,147,null,"00:17:01.500","11:53:39"]
["Margelchopf",null,2163,"Glannachopf","",2232,800,31525,69,null,"00:14:46.500","12:08:25.500"]
["Glannachopf",null,2232,"Chli Fulfirst","",2372,1550,33075,140,null,"00:29:06","12:37:31.500"]
["Chli Fulfirst",null,2372,"Fulfirst","",2384,200,33275,12,null,"00:03:18","12:40:49.500"]
["Fulfirst",null,2384,"Malun Pt. 1922","",1922,1500,34775,-462,null,"00:41:06","13:21:55.500"]
["Malun Pt. 1922",null,1922,"Verzw. Zwingler","",1900,600,35375,-22,null,"00:08:18","13:30:13.500"]
["Verzw. Zwingler",null,1900,"Chli Alvier","",2285,1050,36425,385,null,"00:41:28.500","14:11:42"]
["Chli Alvier",null,2285,"Alvier","",2343,400,36825,58,null,"00:09:09","14:20:51"]
["Alvier",null,2343,"Sattel","",2070,850,37675,-273,null,"00:23:51","14:44:42"]
["Sattel",null,2070,"Chopf","",1997,1000,38675,-73,null,"00:15:39","15:00:21"]
["Chopf",null,1997,"Hurst (Arin)","",1971,600,39275,-26,null,"00:08:30","15:08:51"]
["Hurst (Arin)",null,1971,"Sattel","",2070,1150,40425,99,null,"00:21:13.500","15:30:04.500"]
["Sattel",null,2070,"Matschuns","",2040,1250,41675,-30,null,"00:16:30","15:46:34.500"]
["Matschuns",null,2040,{"$f":"IF(A46<>\"\",A46,\"\")","v":"Gauschla"},"",2310,5050,{"$f":"IF(H44=\"\",\"\",H44+G45)","v":46725},270,null,"01:20:51","17:07:25.500"]
["Gauschla",null,2310,"Fidachöpf","",1540,2250,48975,-770,null,"01:05:30","18:12:55.500"]
["Fidachöpf",null,1540,"Pt. 1410","",1410,1250,50225,-130,null,{"$f":"IF(AND(G47<>\"\",I47<>\"\"),(DistHoriz/LeistungHoriz+ ABS(IF(HöhenDiff<0,HöhenDiff/ZuschlagAbw,HöhenDiff/ZuschlagAuf)))/24,\"\")","v":"00:21:30"},{"$f":"IF(K47=\"\",\"\",L46+K47)","v":"18:34:25.500"}]
["Pt. 1410",null,1410,"Gonzen","",1829,3950,54175,419,null,{"$f":"IF(AND(G48<>\"\",I48<>\"\"),(DistHoriz/LeistungHoriz+ ABS(IF(HöhenDiff<0,HöhenDiff/ZuschlagAbw,HöhenDiff/ZuschlagAuf)))/24,\"\")","v":"01:18:49.500"},{"$f":"IF(K48=\"\",\"\",L47+K48)","v":"19:53:15"}]
["Gonzen",null,1829,"Älpli","",1337,1250,55425,-492,null,{"$f":"IF(AND(G49<>\"\",I49<>\"\"),(DistHoriz/LeistungHoriz+ ABS(IF(HöhenDiff<0,HöhenDiff/ZuschlagAbw,HöhenDiff/ZuschlagAuf)))/24,\"\")","v":"00:39:36"},{"$f":"IF(K49=\"\",\"\",L48+K49)","v":"20:32:51"}]
["Älpli",null,1337,"Sargans Zentrum","",483,4750,60175,-854,null,{"$f":"IF(AND(G50<>\"\",I50<>\"\"),(DistHoriz/LeistungHoriz+ ABS(IF(HöhenDiff<0,HöhenDiff/ZuschlagAbw,HöhenDiff/ZuschlagAuf)))/24,\"\")","v":"01:39:42"},{"$f":"IF(K50=\"\",\"\",L49+K50)","v":"22:12:33"}]
["Sargans Zentrum",null,483,null,null,null,null,null,"",null,{"$f":"IF(AND(G51<>\"\",I51<>\"\"),(DistHoriz/LeistungHoriz+ ABS(IF(HöhenDiff<0,HöhenDiff/ZuschlagAbw,HöhenDiff/ZuschlagAuf)))/24,\"\")","v":""}]
[null,null,null,null,null,null,null,null,{"$f":"SUMIF(I9:I50,\">0\")","v":4858}]
["Total",null,null,null,null,null,{"$f":"IF(G9>0,SUM(G9:G50),\"\")","v":60175},null,null,null,{"$f":"IF(K9<>\"\",SUM(K9:K50),\"\")","v":"22:12:33"},{"$f":"IF(K53=\"\",\"\",ROUND(K53*24*4,0)/4)","v":22.25}]
[null,null,null,null,null,null,null,null,{"$f":"SUMIF(I9:I50,\"<0\")","v":-4922}]
[]
["Höhenprofil",null,null,null,null,"Leistungskilometer:",{"$f":"IF(G53=\"\",\"\",G53/1000+(I52/100))","v":108.755}]

{"sheet":"Grabsumrundung","index":7,"n_rows":56,"n_cols":13,"rows_kept":56,"cut":false,"hidden":false,"merged":[[52,6,52,7]]}
[]
["Marschzeitberechnung",null,null,null,null,null,null,null,null,"Horizontal-Marschleistung:",5000]
[null,null,null,null,null,null,null,null,null,"Zuschlag aufwärts:",800]
[null,null,null,null,null,null,null,null,null,"Zuschlag abwärts:",1200]
[]
["TEILSTRECKE",null,null,null,null,null,"geometr. Parameter",null,null,null,"Marschzeit",null,"Bemerkungen"]
["Ort ","Anfang","Höhe","Ort ","Ende","Höhe","Distanz","kumulativ","Höhendiff.","Azimut","einzeln","kumulativ"]
[null," Koordinaten","m.ü.M.",{"$f":"IF(A9=\"\",\"\",A9)","v":"Grabs (Simmibödeli)"}," Koordinaten",{"$f":"IF(C9=\"\",\"\",C9)","v":547},"m",0,"m","Art.Prom."]
["Grabs (Simmibödeli)","750'850/228'900",547,{"$f":"IF(A10<>\"\",A10,\"\")","v":"Simmitobel Pt. 638"},{"$f":"IF(B10<>\"\",B10,\"\")","v":""},{"$f":"IF(C10<>\"\",C10,\"\")","v":638},1000,{"$f":"IF(G9=\"\",\"\",G9)","v":1000},{"$f":"IF(AND(Höhe1<>\"\",Höhe2<>\"\"),Höhe2-Höhe1,\"\")","v":91},null,{"$f":"IF(AND(G9<>\"\",I9<>\"\"),(DistHoriz/LeistungHoriz+ ABS(IF(HöhenDiff<0,HöhenDiff/ZuschlagAbw,HöhenDiff/ZuschlagAuf)))/24,\"\")","v":"00:18:49.500"},{"$f":"IF(K9=\"\",\"\",K9)","v":"00:18:49.500"}]
["Simmitobel Pt. 638",null,638,"Simmitobel Pt. 700","",700,900,{"$f":"IF(H9=\"\",\"\",H9+G10)","v":1900},62,null,"00:15:27",{"$f":"IF(K10=\"\",\"\",L9+K10)","v":"00:34:16.500"}]
["Simmitobel Pt. 700",null,700,"Hinter Bädli (Abzw.)","748940/228725",900,1250,3150,200,null,"00:30:00","01:04:16.500"]
["Hinter Bädli (Abzw.)","748940/228725",900,"Badweid (Abzw.)","",945,1200,4350,45,null,"00:17:46.500","01:22:03"]
["Badweid (Abzw.)",null,945,"Hiltisbrunnen","",1208,2875,7225,263,null,"00:54:13.500","02:16:16.500"]
["Hiltisbrunnen",null,1208,"Langenwald Pt. 1289","",1289,1550,8775,81,null,"00:24:40.500","02:40:57"]
["Langenwald Pt. 1289",null,1289,"Engi","",1346,2250,11025,57,null,"00:31:16.500","03:12:13.500","querfeldein"]
["Engi",null,1346,"ob Seichbergwald Pt. 1499","",1499,650,11675,153,null,"00:19:16.500","03:31:30"]
["ob Seichbergwald Pt. 1499",null,1499,"Seichberg","",1804,1325,13000,305,null,"00:38:46.500","04:10:16.500","z. T. querfeldein"]
["Seichberg",null,1804,"Unt. Plisen","",1728,950,13950,-76,null,"00:15:12","04:25:28.500"]
["Unt. Plisen",null,1728,"Schlachtböden","",2102,1750,15700,374,null,"00:49:03","05:14:31.500"]
["Schlachtböden",null,2102,"Chäserrugg","",2262,825,16525,160,null,"00:21:54","05:36:25.500"]
["Chäserrugg",null,2262,"Pt. 2208","",2208,1250,17775,-54,null,"00:17:42","05:54:07.500"]
["Pt. 2208",null,2208,"Trestercholben","",2160,450,18225,-48,null,"00:07:48","06:01:55.500"]
["Trestercholben",null,2160,"Trestercholben Fuss","",1980,200,18425,-180,null,"00:11:24","06:13:19.500","abseilen -> mehr Zeit"]
["Trestercholben Fuss",null,1980,"Nideri","",1833,700,19125,-147,null,"00:15:45","06:29:04.500"]
["Nideri",null,1833,"Höchst","",2025,1000,20125,192,null,"00:26:24","06:55:28.500"]
["Höchst",null,2025,"Gulms Seelein","",1820,1000,21125,-205,null,"00:22:15","07:17:43.500"]
["Gulms Seelein",null,1820,"Sichelchamm","",2269,1025,22150,449,null,"00:45:58.500","08:03:42"]
["Sichelchamm",null,2269,"Schiffloch","",2000,375,22525,-269,null,"00:17:57","08:21:39","bei Steinschlag"]
["Schiffloch",null,2000,"Schiffberg","",2195,450,22975,195,null,"00:20:01.500","08:41:40.500","über Chemmi"]
["Schiffberg",null,2195,"Gamsberg Fuss","",2160,400,23375,-35,null,"00:06:33","08:48:13.500","H:1960 D:1'100"]
["Gamsberg Fuss",null,2160,"Gamsberg","",2385,500,23875,225,null,"00:22:52.500","09:11:06","H:2385 D:1'000"]
["Gamsberg",null,2385,"Chemmi (Gamsberg)","",2160,425,24300,-225,null,"00:16:21","09:27:27","(etwa 45' mehr Zeit)"]
["Chemmi (Gamsberg)",null,2160,"Sichli","",2320,300,24600,160,null,"00:15:36","09:43:03"]
["Sichli",null,2320,"Rosswis","",2334,300,24900,14,null,"00:04:39","09:47:42"]
["Rosswis",null,2334,"Loch","",2080,600,25500,-254,null,"00:19:54","10:07:36","evtl. schnellere Route"]
["Loch",null,2080,"Chli Fulfirst","",2372,725,26225,292,null,"00:30:36","10:38:12","evtl. schnellere Route"]
["Chli Fulfirst",null,2372,"Glannachopf Fuss","",2100,875,27100,-272,null,"00:24:06","11:02:18","evtl. schnellere Route"]
["Glannachopf Fuss",null,2100,"Glannachopf","",2232,175,27275,132,null,"00:12:00","11:14:18","evtl. schnellere Route"]
["Glannachopf",null,2232,"Sisitzgrat","",2016,625,27900,-216,null,"00:18:18","11:32:36"]
["Sisitzgrat",null,2016,"Margelchopf","",2167,500,28400,151,null,"00:17:19.500","11:49:55.500"]
["Margelchopf",null,2167,"Forenchopf","",1876,675,29075,-291,null,"00:22:39","12:12:34.500"]
["Forenchopf",null,1876,"Ivelspus","",1170,1625,30700,-706,null,"00:54:48","13:07:22.500"]
["Ivelspus",null,1170,"Wassergass Pt. 899","",899,2150,32850,-271,null,"00:39:21","13:46:43.500"]
["Wassergass Pt. 899",null,899,"Montaschin Abzw.","",650,1725,34575,-249,null,"00:33:09","14:19:52.500","alles der Wassergass"]
["Montaschin Abzw.",null,650,"Werdenberg Pt. 444","",444,1575,36150,-206,null,"00:29:12","14:49:04.500","folgen ist auch möglich"]
["Werdenberg Pt. 444",null,444,"Siedlung","",444,2900,39050,0,null,"00:34:48","15:23:52.500"]
["Siedlung",null,444,"Mümzgraben","",444,1200,40250,0,null,"00:14:24","15:38:16.500"]
["Mümzgraben",null,444,"Rufers","",475,1875,42125,31,null,"00:24:49.500","16:03:06"]
["Rufers",null,475,"Wolfhag","",472,350,42475,-3,null,"00:04:21","16:07:27"]
["Wolfhag",null,472,"Simmibödeli","748940/228725",547,1300,43775,75,null,"00:21:13.500","16:28:40.500"]
["Simmibödeli","748940/228725",547,null,null,null,null,null,"",null,""]
[null,null,null,null,null,null,null,null,{"$f":"SUMIF(I9:I50,\">0\")","v":3707}]
["Total",null,null,null,null,null,{"$f":"IF(G9>0,SUM(G9:G50),\"\")","v":43775},null,null,null,{"$f":"IF(K9<>\"\",SUM(K9:K50),\"\")","v":"16:28:40.500"},{"$f":"IF(K53=\"\",\"\",ROUND(K53*24*4,0)/4)","v":16.5}]
[null,null,null,null,null,null,null,null,{"$f":"SUMIF(I9:I50,\"<0\")","v":-3707}]
[]
["Höhenprofil",null,null,null,null,"Leistungskilometer:",{"$f":"IF(G53=\"\",\"\",G53/1000+(I52/100))","v":80.844999999999999}]

{"sheet":"Zwinglipass","index":8,"n_rows":39,"n_cols":13,"rows_kept":39,"cut":false,"hidden":false,"merged":[[35,6,35,7]]}
[]
["Marschzeitberechnung",null,null,null,null,null,null,null,null,"Horizontal-Marschleistung:",4800]
[null,null,null,null,null,null,null,null,null,"Zuschlag aufwärts:",400]
[null,null,null,null,null,null,null,null,null,"Zuschlag abwärts:",700]
[]
["TEILSTRECKE",null,null,null,null,null,"geometr. Parameter",null,null,null,"Marschzeit",null,"Bemerkungen"]
["Ort ","Anfang","Höhe","Ort ","Ende","Höhe","Distanz","kumulativ","Höhendiff.","Azimut","einzeln","kumulativ"]
[null," Koordinaten","m.ü.M.",{"$f":"IF(A9=\"\",\"\",A9)","v":"Parkplatz"}," Koordinaten",{"$f":"IF(C9=\"\",\"\",C9)","v":1098},"m",0,"m","Art.Prom."]
["Parkplatz","74500/229960",1098,{"$f":"IF(A10<>\"\",A10,\"\")","v":"Gamplüt"},{"$f":"IF(B10<>\"\",B10,\"\")","v":""},{"$f":"IF(C10<>\"\",C10,\"\")","v":1350},1250,{"$f":"IF(G9=\"\",\"\",G9)","v":1250},{"$f":"IF(AND(Höhe1<>\"\",Höhe2<>\"\"),Höhe2-Höhe1,\"\")","v":252},null,{"$f":"IF(AND(G9<>\"\",I9<>\"\"),(DistHoriz/LeistungHoriz+ ABS(IF(HöhenDiff<0,HöhenDiff/ZuschlagAbw,HöhenDiff/ZuschlagAuf)))/24,\"\")","v":"00:53:25.500"},{"$f":"IF(K9=\"\",\"\",K9)","v":"00:53:25.500"}]
["Gamplüt",null,1350,"Fros","",1443,800,{"$f":"IF(H9=\"\",\"\",H9+G10)","v":2050},93,null,"00:23:57",{"$f":"IF(K10=\"\",\"\",L9+K10)","v":"01:17:22.500"}]
["Fros",null,1443,"Pkt.1389","",1389,500,2550,-54,null,"00:10:52.714","01:28:15.214"]
["Pkt.1389",null,1389,"Teselalp","",1433,1000,3550,44,null,"00:19:06","01:47:21.214"]
["Teselalp",null,1433,"Pkt.1499","",1499,600,4150,66,null,"00:17:24","02:04:45.214"]
["Pkt.1499",null,1499,"Zwinglihütte","",1985,2000,6150,486,null,"01:37:54","03:42:39.214"]
["Zwinglihütte",null,1985,"Zwinglipass","",2011,400,6550,26,null,"00:08:54","03:51:33.214"]
["Zwinglipass",null,2011,"Pkt. 2067","",2067,700,7250,56,null,"00:17:09","04:08:42.214"]
["Pkt. 2067",null,2067,"Chreialpfirst","",2125,1100,8350,58,null,"00:22:27","04:31:09.214"]
["Chreialpfirst",null,2125,"Mutschensattel","",2069,700,9050,-56,null,"00:13:33","04:44:42.214"]
["Mutschensattel",null,2069,"Mutschen","",2121,700,9750,52,null,"00:16:33","05:01:15.214"]
["Mutschen",null,2121,"Mutschensattel","",2069,700,10450,-52,null,"00:13:12.429","05:14:27.643"]
["Mutschensattel",null,2069,"Roslenalp","",1767,1500,11950,-302,null,"00:44:38.143","05:59:05.786"]
["Roslenalp",null,1767,"Saxer-Lücke","",1649,800,12750,-118,null,"00:20:06.857","06:19:12.643"]
["Saxer-Lücke",null,1649,"Bollenwees","",1470,800,13550,-179,null,"00:25:20.571","06:44:33.214"]
["Bollenwees",null,1470,"","","",null,13550,"",null,"",""]
[null,null,null,"","","",null,13550,"",null,"",""]
[null,null,null,"","","",null,13550,"",null,"",""]
[null,null,null,"","","",null,13550,"",null,"",""]
[null,null,null,"","","",null,13550,"",null,"",""]
[null,null,null,"","","",null,13550,"",null,"",""]
[null,null,null,"","","",null,13550,"",null,"",""]
[null,null,null,"","","",null,13550,"",null,"",""]
[null,null,null,"","","",null,13550,"",null,"",""]
[null,null,null,"","","",null,13550,"",null,"",""]
[null,null,null,null,null,null,null,null,"",null,""]
[null,null,null,null,null,null,null,null,{"$f":"SUMIF(I9:I33,\">0\")","v":1133}]
["Total",null,null,null,null,null,{"$f":"IF(G9>0,SUM(G9:G33),\"\")","v":13550},null,null,null,{"$f":"IF(K9<>\"\",SUM(K9:K33),\"\")","v":"06:44:33.214"},{"$f":"IF(K36=\"\",\"\",ROUND(K36*24*4,0)/4)","v":6.75}]
[null,null,null,null,null,null,null,null,{"$f":"SUMIF(I9:I33,\"<0\")","v":-761}]
[]
["Höhenprofil",null,null,null,null,"Leistungskilometer:",{"$f":"IF(G36=\"\",\"\",G36/1000+(I35/100))","v":24.880000000000003}]

{"sheet":"Gamsberg","index":9,"n_rows":39,"n_cols":13,"rows_kept":39,"cut":false,"hidden":false,"merged":[[35,6,35,7]]}
[]
["Marschzeitberechnung",null,null,null,null,null,null,null,null,"Horizontal-Marschleistung:",5000]
[null,null,null,null,null,null,null,null,null,"Zuschlag aufwärts:",800]
[null,null,null,null,null,null,null,null,null,"Zuschlag abwärts:",1200]
[]
["TEILSTRECKE",null,null,null,null,null,"geometr. Parameter",null,null,null,"Marschzeit",null,"Bemerkungen"]
["Ort ","Anfang","Höhe","Ort ","Ende","Höhe","Distanz","kumulativ","Höhendiff.","Azimut","einzeln","kumulativ"]
[null," Koordinaten","m.ü.M.",{"$f":"IF(A9=\"\",\"\",A9)","v":"Grabs (Kohlplatz)"}," Koordinaten",{"$f":"IF(C9=\"\",\"\",C9)","v":497},"m",0,"m","Art.Prom."]
["Grabs (Kohlplatz)","751540/227380",497,{"$f":"IF(A10<>\"\",A10,\"\")","v":"Rogghalm"},{"$f":"IF(B10<>\"\",B10,\"\")","v":""},{"$f":"IF(C10<>\"\",C10,\"\")","v":909},2400,{"$f":"IF(G9=\"\",\"\",G9)","v":2400},{"$f":"IF(AND(Höhe1<>\"\",Höhe2<>\"\"),Höhe2-Höhe1,\"\")","v":412},null,{"$f":"IF(AND(G9<>\"\",I9<>\"\"),(DistHoriz/LeistungHoriz+ ABS(IF(HöhenDiff<0,HöhenDiff/ZuschlagAbw,HöhenDiff/ZuschlagAuf)))/24,\"\")","v":"00:59:42"},{"$f":"IF(K9=\"\",\"\",K9)","v":"00:59:42"}]
["Rogghalm",null,909,"Voralp (Kurhaus)","",1218,2950,{"$f":"IF(H9=\"\",\"\",H9+G10)","v":5350},309,null,"00:58:34.500",{"$f":"IF(K10=\"\",\"\",L9+K10)","v":"01:58:16.500"}]
["Voralp (Kurhaus)",null,1218,"Schlawitz (Alti Hütte)","",1585,2850,8200,367,null,"01:01:43.500","03:00:00"]
["Schlawitz (Alti Hütte)",null,1585,"Nideri","",1833,1350,9550,248,null,"00:34:48","03:34:48"]
["Nideri",null,1833,"Höchst","",2025,1000,10550,192,null,"00:26:24","04:01:12"]
["Höchst",null,2025,"Naus Pt. 1482","",1482,1525,12075,-543,null,"00:45:27","04:46:39"]
["Naus Pt. 1482",null,1482,"Unterlänggli","",1649,950,13025,167,null,"00:23:55.500","05:10:34.500"]
["Unterlänggli",null,1649,"Oberlänggli","",1770,675,13700,121,null,"00:17:10.500","05:27:45"]
["Oberlänggli",null,1770,"Chemmi (Gamsberg)","",2170,1580,15280,400,null,"00:48:57.600","06:16:42.600"]
["Chemmi (Gamsberg)",null,2170,"Gamsberg","",2385,425,15705,215,null,"00:21:13.500","06:37:56.100"]
["Gamsberg",null,2385,"Chemmi (Gamsberg)","",2170,425,16130,-215,null,"00:15:51","06:53:47.100"]
["Chemmi (Gamsberg)",null,2170,"Oberlänggli","",1770,1580,17710,-400,null,"00:38:57.600","07:32:44.700"]
["Oberlänggli",null,1770,"","","",null,17710,"",null,"",""]
[null,null,null,"","","",null,17710,"",null,"",""]
[null,null,null,"","","",null,17710,"",null,"",""]
[null,null,null,"","","",null,17710,"",null,"",""]
[null,null,null,"","","",null,17710,"",null,"",""]
[null,null,null,"","","",null,17710,"",null,"",""]
[null,null,null,"","","",null,17710,"",null,"",""]
[null,null,null,"","","",null,17710,"",null,"",""]
[null,null,null,"","","",null,17710,"",null,"",""]
[null,null,null,"","","",null,17710,"",null,"",""]
[null,null,null,"","","",null,17710,"",null,"",""]
[null,null,null,"","","",null,17710,"",null,"",""]
[null,null,null,"","","",null,17710,"",null,"",""]
[null,null,null,null,null,null,null,null,"",null,""]
[null,null,null,null,null,null,null,null,{"$f":"SUMIF(I9:I33,\">0\")","v":2431}]
["Total",null,null,null,null,null,{"$f":"IF(G9>0,SUM(G9:G33),\"\")","v":17710},null,null,null,{"$f":"IF(K9<>\"\",SUM(K9:K33),\"\")","v":"07:32:44.700"},{"$f":"IF(K36=\"\",\"\",ROUND(K36*24*4,0)/4)","v":7.5}]
[null,null,null,null,null,null,null,null,{"$f":"SUMIF(I9:I33,\"<0\")","v":-1158}]
[]
["Höhenprofil",null,null,null,null,"Leistungskilometer:",{"$f":"IF(G36=\"\",\"\",G36/1000+(I35/100))","v":42.019999999999996}]

{"sheet":"Pfälzerhütte-Naafkopf","index":10,"n_rows":39,"n_cols":13,"rows_kept":39,"cut":false,"hidden":false,"merged":[[35,6,35,7]]}
[]
["Marschzeitberechnung",null,null,null,null,null,null,null,null,"Horizontal-Marschleistung:",5000]
[null,null,null,null,null,null,null,null,null,"Zuschlag aufwärts:",800]
[null,null,null,null,null,null,null,null,null,"Zuschlag abwärts:",1200]
[]
["TEILSTRECKE",null,null,null,null,null,"geometr. Parameter",null,null,null,"Marschzeit",null,"Bemerkungen"]
["Ort ","Anfang","Höhe","Ort ","Ende","Höhe","Distanz","kumulativ","Höhendiff.","Azimut","einzeln","kumulativ"]
[null," Koordinaten","m.ü.M.",{"$f":"IF(A9=\"\",\"\",A9)","v":"Steg Pt. 1303"}," Koordinaten",{"$f":"IF(C9=\"\",\"\",C9)","v":1303},"m",0,"m","Art.Prom."]
["Steg Pt. 1303","762200/220160",1303,{"$f":"IF(A10<>\"\",A10,\"\")","v":"Klein Steg (Parkplatz)"},{"$f":"IF(B10<>\"\",B10,\"\")","v":""},{"$f":"IF(C10<>\"\",C10,\"\")","v":1303},825,{"$f":"IF(G9=\"\",\"\",G9)","v":825},{"$f":"IF(AND(Höhe1<>\"\",Höhe2<>\"\"),Höhe2-Höhe1,\"\")","v":0},null,{"$f":"IF(AND(G9<>\"\",I9<>\"\"),(DistHoriz/LeistungHoriz+ ABS(IF(HöhenDiff<0,HöhenDiff/ZuschlagAbw,HöhenDiff/ZuschlagAuf)))/24,\"\")","v":"00:09:54"},{"$f":"IF(K9=\"\",\"\",K9)","v":"00:09:54"}]
["Klein Steg (Parkplatz)",null,1303,"Alp Valüna","",1409,2675,{"$f":"IF(H9=\"\",\"\",H9+G10)","v":3500},106,null,"00:40:03",{"$f":"IF(K10=\"\",\"\",L9+K10)","v":"00:49:57"}]
["Alp Valüna",null,1409,"Obersäss","",1646,1975,5475,237,null,"00:41:28.500","01:31:25.500"]
["Obersäss",null,1646,"Friedböden","",1811,750,6225,165,null,"00:21:22.500","01:52:48"]
["Friedböden",null,1811,"Gritschner Naaf","",1900,825,7050,89,null,"00:16:34.500","02:09:22.500"]
["Gritschner Naaf",null,1900,"Pfälzerhütte","",2111,925,7975,211,null,"00:26:55.500","02:36:18"]
["Pfälzerhütte",null,2111,"Naafkopf","",2570,1600,9575,459,null,"00:53:37.500","03:29:55.500"]
["Naafkopf",null,2570,"Pfälzerhütte","",2111,1600,11175,-459,null,"00:42:09","04:12:04.500","allein: 36'"]
["Pfälzerhütte",null,2111,"Augstenberg","",2359,1425,12600,248,null,"00:35:42","04:47:46.500","allein: 20'"]
["Augstenberg",null,2359,"Sareiser Joch","",2000,2050,14650,-359,null,"00:42:33","05:30:19.500"]
["Sareiser Joch",null,2000,"Kuhloch","",1956,575,15225,-44,null,"00:09:06","05:39:25.500"]
["Kuhloch",null,1956,"Bergstation (Beim Kreuz)","",1990,400,15625,34,null,"00:07:21","05:46:46.500"]
["Bergstation (Beim Kreuz)",null,1990,"Malbun Pt. 1599","764640/219130",1599,2750,18375,-391,null,"00:52:33","06:39:19.500"]
["Malbun Pt. 1599","764640/219130",1599,"","","",null,18375,"",null,"",""]
[null,null,null,"","","",null,18375,"",null,"",""]
[null,null,null,"","","",null,18375,"",null,"",""]
[null,null,null,"","","",null,18375,"",null,"",""]
[null,null,null,"","","",null,18375,"",null,"",""]
[null,null,null,"","","",null,18375,"",null,"",""]
[null,null,null,"","","",null,18375,"",null,"",""]
[null,null,null,"","","",null,18375,"",null,"",""]
[null,null,null,"","","",null,18375,"",null,"",""]
[null,null,null,"","","",null,18375,"",null,"",""]
[null,null,null,"","","",null,18375,"",null,"",""]
[null,null,null,"","","",null,18375,"",null,"",""]
[null,null,null,null,null,null,null,null,"",null,""]
[null,null,null,null,null,null,null,null,{"$f":"SUMIF(I9:I33,\">0\")","v":1549}]
["Total",null,null,null,null,null,{"$f":"IF(G9>0,SUM(G9:G33),\"\")","v":18375},null,null,null,{"$f":"IF(K9<>\"\",SUM(K9:K33),\"\")","v":"06:39:19.500"},{"$f":"IF(K36=\"\",\"\",ROUND(K36*24*4,0)/4)","v":6.75}]
[null,null,null,null,null,null,null,null,{"$f":"SUMIF(I9:I33,\"<0\")","v":-1253}]
[]
["Höhenprofil",null,null,null,null,"Leistungskilometer:",{"$f":"IF(G36=\"\",\"\",G36/1000+(I35/ZuschlagAuf+I37/-ZuschlagAbw)*(LeistungHoriz/1000))","v":33.277083333333337}]

{"sheet":"Pfälzerhütte KBW 2004","index":11,"n_rows":39,"n_cols":13,"rows_kept":39,"cut":false,"hidden":false,"merged":[[35,6,35,7]]}
[]
["Marschzeitberechnung",null,null,null,null,null,null,null,null,"Horizontal-Marschleistung:",4500]
[null,null,null,null,null,null,null,null,null,"Zuschlag aufwärts:",400]
[null,null,null,null,null,null,null,null,null,"Zuschlag abwärts:",800]
[]
["TEILSTRECKE",null,null,null,null,null,"geometr. Parameter",null,null,null,"Marschzeit",null,"Bemerkungen"]
["Ort ","Anfang","Höhe","Ort ","Ende","Höhe","Distanz","kumulativ","Höhendiff.","Azimut","einzeln","kumulativ"]
[null," Koordinaten","m.ü.M.",{"$f":"IF(A9=\"\",\"\",A9)","v":"Steg Pt. 1303"}," Koordinaten",{"$f":"IF(C9=\"\",\"\",C9)","v":1303},"m",0,"m","Art.Prom."]
["Steg Pt. 1303","762200/220160",1303,{"$f":"IF(A10<>\"\",A10,\"\")","v":"Klein Steg (Parkplatz)"},{"$f":"IF(B10<>\"\",B10,\"\")","v":""},{"$f":"IF(C10<>\"\",C10,\"\")","v":1303},825,{"$f":"IF(G9=\"\",\"\",IF(G9=H8,\"\",G9))","v":825},{"$f":"IF(AND(Höhe1<>\"\",Höhe2<>\"\"),Höhe2-Höhe1,\"\")","v":0},null,{"$f":"IF(AND(G9<>\"\",I9<>\"\"),(DistHoriz/LeistungHoriz+ ABS(IF(HöhenDiff<0,HöhenDiff/ZuschlagAbw,HöhenDiff/ZuschlagAuf)))/24,\"\")","v":"00:11:00"},{"$f":"IF(K9=\"\",\"\",K9)","v":"00:11:00"}]
["Klein Steg (Parkplatz)",null,1303,"Alp Valüna","",1409,2675,{"$f":"IF(H9=\"\",\"\",H9+G10)","v":3500},106,null,"00:51:34",{"$f":"IF(K10=\"\",\"\",L9+K10)","v":"01:02:34"}]
["Alp Valüna",null,1409,"Obersäss","",1646,1975,5475,237,null,"01:01:53","02:04:27"]
["Obersäss",null,1646,"Friedböden","",1811,750,6225,165,null,"00:34:45","02:39:12"]
["Friedböden",null,1811,"Gritschner Naaf","",1900,825,7050,89,null,"00:24:21","03:03:33"]
["Gritschner Naaf",null,1900,"Pfälzerhütte","",2111,925,7975,211,null,"00:43:59","03:47:32"]
["Pfälzerhütte",null,2111,"Augstenberg","",2359,1425,9400,248,null,"00:56:12","04:43:44"]
["Augstenberg",null,2359,"Sareiser Joch","",2000,2050,11450,-359,null,"00:54:15.500","05:37:59.500"]
["Sareiser Joch",null,2000,"Kuhloch","",1956,575,12025,-44,null,"00:10:58","05:48:57.500"]
["Kuhloch",null,1956,"Bergstation (Beim Kreuz)","",1990,400,12425,34,null,"00:10:26","05:59:23.500"]
["Bergstation (Beim Kreuz)",null,1990,"Malbun Pt. 1599","764640/219130",1599,2750,15175,-391,null,"01:05:59.500","07:05:23"]
["Malbun Pt. 1599","764640/219130",1599,"","","",null,15175,"",null,"",""]
[null,null,null,"","","",null,15175,"",null,"",""]
[null,null,null,"","","",null,15175,"",null,"",""]
[null,null,null,"","","",null,15175,"",null,"",""]
[null,null,null,"","","",null,15175,"",null,"",""]
[null,null,null,"","","",null,15175,"",null,"",""]
[null,null,null,"","","",null,15175,"",null,"",""]
[null,null,null,"","","",null,15175,"",null,"",""]
[null,null,null,"","","",null,15175,"",null,"",""]
[null,null,null,"","","",null,15175,"",null,"",""]
[null,null,null,"","","",null,15175,"",null,"",""]
[null,null,null,"","","",null,15175,"",null,"",""]
[null,null,null,"","","",null,15175,"",null,"",""]
[null,null,null,"","","",null,15175,"",null,"",""]
[null,null,null,null,null,null,null,null,"",null,""]
[null,null,null,null,null,null,null,null,{"$f":"SUMIF(I9:I33,\">0\")","v":1090}]
["Total",null,null,null,null,null,{"$f":"IF(G9>0,SUM(G9:G33),\"\")","v":15175},null,null,null,{"$f":"IF(K9<>\"\",SUM(K9:K33),\"\")","v":"07:05:23"},{"$f":"IF(K36=\"\",\"\",ROUND(K36*24*4,0)/4)","v":7}]
[null,null,null,null,null,null,null,null,{"$f":"SUMIF(I9:I33,\"<0\")","v":-794}]
[]
["Höhenprofil",null,null,null,null,"Leistungskilometer:",{"$f":"IF(G36=\"\",\"\",G36/1000+(I35/ZuschlagAuf+I37/-ZuschlagAbw)*(LeistungHoriz/1000))","v":31.903750000000002}]

{"sheet":"Gamsalp–Langwitti–Voralp","index":12,"n_rows":39,"n_cols":13,"rows_kept":39,"cut":false,"hidden":false,"merged":[[35,6,35,7]]}
[]
["Marschzeitberechnung",null,null,null,null,null,null,null,null,"Horizontal-Marschleistung:",4500]
[null,null,null,null,null,null,null,null,null,"Zuschlag aufwärts:",400]
[null,null,null,null,null,null,null,null,null,"Zuschlag abwärts:",800]
[]
["TEILSTRECKE",null,null,null,null,null,"geometr. Parameter",null,null,null,"Marschzeit",null,"Bemerkungen"]
["Ort ","Anfang","Höhe","Ort ","Ende","Höhe","Distanz","kumulativ","Höhendiff.","Azimut","einzeln","kumulativ"]
[null," Koordinaten","m.ü.M.",{"$f":"IF(A9=\"\",\"\",A9)","v":"Gamsalp"}," Koordinaten",{"$f":"IF(C9=\"\",\"\",C9)","v":1767},"m",0,"m","Art.Prom."]
["Gamsalp","744080/226375",1767,{"$f":"IF(A10<>\"\",A10,\"\")","v":"Warmtobel"},{"$f":"IF(B10<>\"\",B10,\"\")","v":"744250/226200"},{"$f":"IF(C10<>\"\",C10,\"\")","v":1740},250,{"$f":"IF(G9=\"\",\"\",IF(G9=H8,\"\",G9))","v":250},{"$f":"IF(AND(Höhe1<>\"\",Höhe2<>\"\"),Höhe2-Höhe1,\"\")","v":-27},null,{"$f":"IF(AND(G9<>\"\",I9<>\"\"),(DistHoriz/LeistungHoriz+ ABS(IF(HöhenDiff<0,HöhenDiff/ZuschlagAbw,HöhenDiff/ZuschlagAuf)))/24,\"\")","v":"00:05:21.500"},{"$f":"IF(K9=\"\",\"\",K9)","v":"00:05:21.500"}]
["Warmtobel","744250/226200",1740,"Warmtobel II","744425/226250",1740,150,{"$f":"IF(H9=\"\",\"\",H9+G10)","v":400},0,null,"00:02:00",{"$f":"IF(K10=\"\",\"\",L9+K10)","v":"00:07:21.500"}]
["Warmtobel II","744425/226250",1740,"Inggadells","744525/225975",1800,300,700,60,null,"00:13:00","00:20:21.500"]
["Inggadells","744525/225975",1800,"Sattel (Marzils)","744750/226050",1780,125,825,-20,null,"00:03:10","00:23:31.500"]
["Sattel (Marzils)","744750/226050",1780,"Langwitti-Schacht","744800/225975",1765,200,1025,-15,null,"00:03:47.500","00:27:19"]
["Langwitti-Schacht","744800/225975",1765,"Alp Sässli","745225/226275",1695,500,1525,-70,null,"00:11:55","00:39:14"]
["Alp Sässli","745225/226275",1695,"Hintere Witti","746275/226025",1380,1650,3175,-315,null,"00:45:37.500","01:24:51.500"]
["Hintere Witti","746275/226025",1380,"Gamperfin","747025/226200",1303,1060,4235,-77,null,"00:19:54.500","01:44:46"]
["Gamperfin","747025/226200",1303,"Voralp Kurhaus","747020/225320",1218,1160,5395,-85,null,"00:21:50.500","02:06:36.500"]
["Voralp Kurhaus","747020/225320",1218,"","","",null,5395,"",null,"",""]
[null,null,null,"","","",null,5395,"",null,"",""]
[null,null,null,"","","",null,5395,"",null,"",""]
[null,null,null,"","","",null,5395,"",null,"",""]
[null,null,null,"","","",null,5395,"",null,"",""]
[null,null,null,"","","",null,5395,"",null,"",""]
[null,null,null,"","","",null,5395,"",null,"",""]
[null,null,null,"","","",null,5395,"",null,"",""]
[null,null,null,"","","",null,5395,"",null,"",""]
[null,null,null,"","","",null,5395,"",null,"",""]
[null,null,null,"","","",null,5395,"",null,"",""]
[null,null,null,"","","",null,5395,"",null,"",""]
[null,null,null,"","","",null,5395,"",null,"",""]
[null,null,null,"","","",null,5395,"",null,"",""]
[null,null,null,"","","",null,5395,"",null,"",""]
[null,null,null,"","","",null,5395,"",null,"",""]
[null,null,null,null,null,null,null,null,"",null,""]
[null,null,null,null,null,null,null,null,{"$f":"SUMIF(I9:I33,\">0\")","v":60}]
["Total",null,null,null,null,null,{"$f":"IF(G9>0,SUM(G9:G33),\"\")","v":5395},null,null,null,{"$f":"IF(K9<>\"\",SUM(K9:K33),\"\")","v":"02:06:36.500"},{"$f":"IF(K36=\"\",\"\",ROUND(K36*24*4,0)/4)","v":2}]
[null,null,null,null,null,null,null,null,{"$f":"SUMIF(I9:I33,\"<0\")","v":-609}]
[]
["Höhenprofil",null,null,null,null,"Leistungskilometer:",{"$f":"IF(G36=\"\",\"\",G36/1000+(I35/ZuschlagAuf+I37/-ZuschlagAbw)*(LeistungHoriz/1000))","v":9.4956250000000004}]

{"sheet":"Sagenweg Sennwald","index":13,"n_rows":39,"n_cols":13,"rows_kept":39,"cut":false,"hidden":false,"merged":[[35,6,35,7]]}
[]
["Marschzeitberechnung",null,null,null,null,null,null,null,null,"Horizontal-Marschleistung:",4500]
[null,null,null,null,null,null,null,null,null,"Zuschlag aufwärts:",400]
[null,null,null,null,null,null,null,null,null,"Zuschlag abwärts:",800]
[]
["TEILSTRECKE",null,null,null,null,null,"geometr. Parameter",null,null,null,"Marschzeit",null,"Bemerkungen"]
["Ort ","Anfang","Höhe","Ort ","Ende","Höhe","Distanz","kumulativ","Höhendiff.","Azimut","einzeln","kumulativ"]
[null," Koordinaten","m.ü.M.",{"$f":"IF(A9=\"\",\"\",A9)","v":"Parkplatz Staubern"}," Koordinaten",{"$f":"IF(C9=\"\",\"\",C9)","v":480},"m",0,"m","Art.Prom."]
["Parkplatz Staubern",null,480,{"$f":"IF(A10<>\"\",A10,\"\")","v":"Usser Trat"},{"$f":"IF(B10<>\"\",B10,\"\")","v":""},{"$f":"IF(C10<>\"\",C10,\"\")","v":630},1410,{"$f":"IF(G9=\"\",\"\",IF(G9=H8,\"\",G9))","v":1410},{"$f":"IF(AND(Höhe1<>\"\",Höhe2<>\"\"),Höhe2-Höhe1,\"\")","v":150},null,{"$f":"IF(AND(G9<>\"\",I9<>\"\"),(DistHoriz/LeistungHoriz+ ABS(IF(HöhenDiff<0,HöhenDiff/ZuschlagAbw,HöhenDiff/ZuschlagAuf)))/24,\"\")","v":"00:41:18"},{"$f":"IF(K9=\"\",\"\",K9)","v":"00:41:18"}]
["Usser Trat",null,630,"Haldehüser","",650,1310,{"$f":"IF(H9=\"\",\"\",H9+G10)","v":2720},20,null,"00:20:28",{"$f":"IF(K10=\"\",\"\",L9+K10)","v":"01:01:46"}]
["Haldehüser",null,650,"Runggelätsch","",605,640,3360,-45,null,"00:11:54.500","01:13:40.500"]
["Runggelätsch",null,605,"Burgruine Hohensax","",750,870,4230,145,null,"00:33:21","01:47:01.500"]
["Burgruine Hohensax",null,750,"Pt. 835 (Nasseel)","",835,690,4920,85,null,"00:21:57","02:08:58.500"]
["Pt. 835 (Nasseel)",null,835,"Haldehüser","",650,2310,7230,-185,null,"00:44:40.500","02:53:39"]
["Haldehüser",null,650,"Usser Trat","",630,1310,8540,-20,null,"00:18:58","03:12:37"]
["Usser Trat",null,630,"Parkplatz Staubern","",480,1410,9950,-150,null,"00:30:03","03:42:40"]
["Parkplatz Staubern",null,480,"","","",null,9950,"",null,"",""]
[null,null,null,"","","",null,9950,"",null,"",""]
[null,null,null,"","","",null,9950,"",null,"",""]
[null,null,null,"","","",null,9950,"",null,"",""]
[null,null,null,"","","",null,9950,"",null,"",""]
[null,null,null,"","","",null,9950,"",null,"",""]
[null,null,null,"","","",null,9950,"",null,"",""]
[null,null,null,"","","",null,9950,"",null,"",""]
[null,null,null,"","","",null,9950,"",null,"",""]
[null,null,null,"","","",null,9950,"",null,"",""]
[null,null,null,"","","",null,9950,"",null,"",""]
[null,null,null,"","","",null,9950,"",null,"",""]
[null,null,null,"","","",null,9950,"",null,"",""]
[null,null,null,"","","",null,9950,"",null,"",""]
[null,null,null,"","","",null,9950,"",null,"",""]
[null,null,null,"","","",null,9950,"",null,"",""]
[null,null,null,"","","",null,9950,"",null,"",""]
[null,null,null,null,null,null,null,null,"",null,""]
[null,null,null,null,null,null,null,null,{"$f":"SUMIF(I9:I33,\">0\")","v":400}]
["Total",null,null,null,null,null,{"$f":"IF(G9>0,SUM(G9:G33),\"\")","v":9950},null,null,null,{"$f":"IF(K9<>\"\",SUM(K9:K33),\"\")","v":"03:42:40"},{"$f":"IF(K36=\"\",\"\",ROUND(K36*24*4,0)/4)","v":3.75}]
[null,null,null,null,null,null,null,null,{"$f":"SUMIF(I9:I33,\"<0\")","v":-400}]
[]
["Höhenprofil",null,null,null,null,"Leistungskilometer:",{"$f":"IF(G36=\"\",\"\",G36/1000+(I35/ZuschlagAuf+I37/-ZuschlagAbw)*(LeistungHoriz/1000))","v":16.7}]

{"sheet":"Wassergasse-Grubenweg","index":14,"n_rows":39,"n_cols":13,"rows_kept":39,"cut":false,"hidden":false,"merged":[[35,6,35,7]]}
[]
["Marschzeitberechnung",null,null,null,null,null,null,null,null,"Horizontal-Marschleistung:",4500]
[null,null,null,null,null,null,null,null,null,"Zuschlag aufwärts:",400]
[null,null,null,null,null,null,null,null,null,"Zuschlag abwärts:",800]
[]
["TEILSTRECKE",null,null,null,null,null,"geometr. Parameter",null,null,null,"Marschzeit",null,"Bemerkungen"]
["Ort ","Anfang","Höhe","Ort ","Ende","Höhe","Distanz","kumulativ","Höhendiff.","Azimut","einzeln","kumulativ"]
[null," Koordinaten","m.ü.M.",{"$f":"IF(A9=\"\",\"\",A9)","v":"Egeten Vita-Parcour"}," Koordinaten",{"$f":"IF(C9=\"\",\"\",C9)","v":520},"m",0,"m","Art.Prom."]
["Egeten Vita-Parcour",null,520,{"$f":"IF(A10<>\"\",A10,\"\")","v":"Burgerholz"},{"$f":"IF(B10<>\"\",B10,\"\")","v":""},{"$f":"IF(C10<>\"\",C10,\"\")","v":598},500,{"$f":"IF(G9=\"\",\"\",IF(G9=H8,\"\",G9))","v":500},{"$f":"IF(AND(Höhe1<>\"\",Höhe2<>\"\"),Höhe2-Höhe1,\"\")","v":78},null,{"$f":"IF(AND(G9<>\"\",I9<>\"\"),(DistHoriz/LeistungHoriz+ ABS(IF(HöhenDiff<0,HöhenDiff/ZuschlagAbw,HöhenDiff/ZuschlagAuf)))/24,\"\")","v":"00:18:22"},{"$f":"IF(K9=\"\",\"\",K9)","v":"00:18:22"}]
["Burgerholz",null,598,"Haslen","",838,1600,{"$f":"IF(H9=\"\",\"\",H9+G10)","v":2100},240,null,"00:57:20",{"$f":"IF(K10=\"\",\"\",L9+K10)","v":"01:15:42"}]
["Haslen",null,838,"Pt. 899","",899,500,2600,61,null,"00:15:49","01:31:31"]
["Pt. 899",null,899,"Pt. 1079","",1079,1100,3700,180,null,"00:41:40","02:13:11"]
["Pt. 1079",null,1079,"Valspus (Säss)","",1170,1150,4850,91,null,"00:28:59","02:42:10"]
["Valspus (Säss)",null,1170,"Gschwemmtenwalt Abzw.","",1155,350,5200,-15,null,"00:05:47.500","02:47:57.500"]
["Gschwemmtenwalt Abzw.",null,1155,"Härzer","",1000,700,5900,-155,null,"00:20:57.500","03:08:55"]
["Härzer",null,1000,"Pt. 929","",929,800,6700,-71,null,"00:15:59.500","03:24:54.500"]
["Pt. 929",null,929,"Gruaba","",820,400,7100,-109,null,"00:13:30.500","03:38:25"]
["Gruaba",null,820,"Bannwald","",855,700,7800,35,null,"00:14:35","03:53:00"]
["Bannwald",null,855,"Rogghalm","",877,750,8550,22,null,"00:13:18","04:06:18"]
["Rogghalm",null,877,"Löchli","",592,1400,9950,-285,null,"00:40:02.500","04:46:20.500"]
["Löchli",null,592,"Kohlplatz","",497,800,10750,-95,null,"00:17:47.500","05:04:08"]
["Kohlplatz",null,497,"","","",null,10750,"",null,"",""]
[null,null,null,"","","",null,10750,"",null,"",""]
[null,null,null,"","","",null,10750,"",null,"",""]
[null,null,null,"","","",null,10750,"",null,"",""]
[null,null,null,"","","",null,10750,"",null,"",""]
[null,null,null,"","","",null,10750,"",null,"",""]
[null,null,null,"","","",null,10750,"",null,"",""]
[null,null,null,"","","",null,10750,"",null,"",""]
[null,null,null,"","","",null,10750,"",null,"",""]
[null,null,null,"","","",null,10750,"",null,"",""]
[null,null,null,"","","",null,10750,"",null,"",""]
[null,null,null,"","","",null,10750,"",null,"",""]
[null,null,null,null,null,null,null,null,"",null,""]
[null,null,null,null,null,null,null,null,{"$f":"SUMIF(I9:I33,\">0\")","v":707}]
["Total",null,null,null,null,null,{"$f":"IF(G9>0,SUM(G9:G33),\"\")","v":10750},null,null,null,{"$f":"IF(K9<>\"\",SUM(K9:K33),\"\")","v":"05:04:08"},{"$f":"IF(K36=\"\",\"\",ROUND(K36*24*4,0)/4)","v":5}]
[null,null,null,null,null,null,null,null,{"$f":"SUMIF(I9:I33,\"<0\")","v":-730}]
[]
["Höhenprofil",null,null,null,null,"Leistungskilometer:",{"$f":"IF(G36=\"\",\"\",G36/1000+(I35/ZuschlagAuf+I37/-ZuschlagAbw)*(LeistungHoriz/1000))","v":22.810000000000002}]